سلام ، آیا این بازدید اول شماست ؟ یا
logo_forum_header

تبلیغات
×
+
سفارش تبلیغات

صفحه 2 از 3 نخستنخست 123 آخرینآخرین
نمایش نتایج: از 11 به 20 از 22

موضوع: اسکریپت Transmogrify برای ترینیتی 4.3.4

  1. #11
    دستاورد ها:
    اجتماعیRecommendation First Class1 سال ثبت نام شده استبرچسب زن کلاس اولاوردرایو

    شماره عضویت
    1
    تاریخ عضویت
    Oct 2014
    محل سکونت
    بوشهر
    نوشته ها
    1,774
    نسل
    نسل مورد علاقه
    نژاد
    نژاد  مورد علاقه
    کلاس
     کلاس  مورد علاقه
    سورس
     سورس مورد علاقه
    پچ
    پچ مورد علاقه
    پسندیده : 725
    مورد پسند : 1,163 بار در 582 پست
    سیستم عامل و مرورگر:
    اصلا build\src\server\scripts\scripts.dir\Release اشتباههههههه.
    بابا اصلا تو هرکاری میخوای بکنی باید رو سورس انجام بدی نه cmake شده اش.

  2. # ADS
    سیستم تبلیغات
    تاریخ عضویت
    01/01/2014
    محل سکونت
    Advertising world
    نوشته ها
    پستی ندارد.
     

  3. #12
    دستاورد ها:
    1 سال ثبت نام شده استبرچسب زن کلاس اول۱۰۰۰ امتیازاوردرایو

    شماره عضویت
    170
    تاریخ عضویت
    Feb 2015
    محل سکونت
    Iran-Tabriz
    نوشته ها
    202
    نسل
    نسل مورد علاقه
    نژاد
    نژاد  مورد علاقه
    کلاس
     کلاس  مورد علاقه
    سورس
     سورس مورد علاقه
    پچ
    پچ مورد علاقه
    پسندیده : 124
    مورد پسند : 60 بار در 43 پست
    سیستم عامل و مرورگر:
    سلام.
    من 1دونه ویدیو آماده کردم میشه 1نگاهی بندازید ببینید چرا این ارور رو میده.
    اولین کار که کردم طبق فیلم آموزشی رفتم جلو و بعد رفتم پوشه سرور trinitycoreرو با VS2013باز کردم بعد تو قسمت scriptsدکمهbuildرو فشار دادم اما ارور داد.
    کد PHP:
     <CustomBuild      Sources                     ="@(CustomBuild)"      BuildSuffix                 ="$(_BuildSuffix)"
          
    TrackerLogDirectory         ="%(CustomBuild.TrackerLogDirectory)"      MinimalRebuildFromTracking  ="%(CustomBuild.MinimalRebuildFromTracking)"
          
    TLogReadFiles               ="@(CustomBuildTLogReadFiles)"      TLogWriteFiles              ="@(CustomBuildTLogWriteFiles)"      TrackFileAccess             ="$(TrackFileAccess)"      ToolArchitecture            ="$(CustomBuildToolArchitecture)"      TrackerFrameworkPath        ="$(CustomBuildTrackerFrameworkPath)"      TrackerSdkPath              ="$(CustomBuildTrackerSdkPath)"
          
    AcceptableNonZeroExitCodes  ="%(CustomBuild.AcceptableNonZeroExitCodes)"      >    </CustomBuild
    این ارورش هست فیلم رو اگه مایل هستید بهتون نشون بدم .
    ویرایش توسط uther : 02-16-2015 در ساعت 07:30 PM

  4. #13
    دستاورد ها:
    اجتماعیRecommendation First Class1 سال ثبت نام شده استبرچسب زن کلاس اولاوردرایو

    شماره عضویت
    1
    تاریخ عضویت
    Oct 2014
    محل سکونت
    بوشهر
    نوشته ها
    1,774
    نسل
    نسل مورد علاقه
    نژاد
    نژاد  مورد علاقه
    کلاس
     کلاس  مورد علاقه
    سورس
     سورس مورد علاقه
    پچ
    پچ مورد علاقه
    پسندیده : 725
    مورد پسند : 1,163 بار در 582 پست
    سیستم عامل و مرورگر:
    از کاری که انجام دادی فیلم بگیر بزار ببینم .

  5. #14
    دستاورد ها:
    1 سال ثبت نام شده استبرچسب زن کلاس اول۱۰۰۰ امتیازاوردرایو

    شماره عضویت
    170
    تاریخ عضویت
    Feb 2015
    محل سکونت
    Iran-Tabriz
    نوشته ها
    202
    نسل
    نسل مورد علاقه
    نژاد
    نژاد  مورد علاقه
    کلاس
     کلاس  مورد علاقه
    سورس
     سورس مورد علاقه
    پچ
    پچ مورد علاقه
    پسندیده : 124
    مورد پسند : 60 بار در 43 پست
    سیستم عامل و مرورگر:
    خوب این عکس مربوط به فیلم آموزشی هست که با توجه به فیلم انجام دادم.




    افزوده شده بعد از 7 دقیقه :
    پس از قسمت بالا رفتم سراغ فایل های کمپایل شده و trinitycoreرو باز کردم:

    اینم ارور:


    ویرایش توسط uther : 02-16-2015 در ساعت 08:54 PM دلیل: ادغام پست

  6. #15
    دستاورد ها:
    اجتماعیRecommendation First Class1 سال ثبت نام شده استبرچسب زن کلاس اولاوردرایو

    شماره عضویت
    1
    تاریخ عضویت
    Oct 2014
    محل سکونت
    بوشهر
    نوشته ها
    1,774
    نسل
    نسل مورد علاقه
    نژاد
    نژاد  مورد علاقه
    کلاس
     کلاس  مورد علاقه
    سورس
     سورس مورد علاقه
    پچ
    پچ مورد علاقه
    پسندیده : 725
    مورد پسند : 1,163 بار در 582 پست
    سیستم عامل و مرورگر:
    اولا که Boss_Alysrazor رو باید توی مسیر src\server\scripts\Kalimdor\Firelands بریزی نه توی کاستوم .

    دوما Transmorgrification.h رو هم باید به Cmakelist.txt ادد کنی .

    سوما برای کامپایل روی All Build کلیک راست و Build رو بزن .

  7. #16
    دستاورد ها:
    1 سال ثبت نام شده استبرچسب زن کلاس اول۱۰۰۰ امتیازاوردرایو

    شماره عضویت
    170
    تاریخ عضویت
    Feb 2015
    محل سکونت
    Iran-Tabriz
    نوشته ها
    202
    نسل
    نسل مورد علاقه
    نژاد
    نژاد  مورد علاقه
    کلاس
     کلاس  مورد علاقه
    سورس
     سورس مورد علاقه
    پچ
    پچ مورد علاقه
    پسندیده : 124
    مورد پسند : 60 بار در 43 پست
    سیستم عامل و مرورگر:
    همین کار رو کردم ارور داد:
    Build started 2/25/2015 12:22:49 AM. 1>Project "E:\build\src\server\scripts\scripts.vcxproj" on node 2 (Build target(s)).
    1>CustomBuild:
    Building Custom Rule C:/Users/Hadi/Desktop/TrinityCore-4.3.4/TrinityCore-4.3.4/src/server/scripts/CMakeLists.txt
    CMake is re-running because E:\build\src\server\scripts\CMakeFiles\generate.st amp is out-of-date.
    the file 'C:/Users/Hadi/Desktop/TrinityCore-4.3.4/TrinityCore-4.3.4/src/server/scripts/Custom/CMakeLists.txt'
    is newer than 'E:\build\src\server\scripts\CMakeFiles\generate.s tamp.depend'
    result='-1'
    -- Building for: Visual Studio 12 2013
    -- Detected 32-bit platform
    -- MSVC: Enabled large address awareness
    -- MSVC: Enabled SSE2 support
    -- MSVC: Disabled Safe Exception Handlers for debug builds
    -- MSVC: Overloaded standard names
    -- MSVC: Disabled NON-SECURE warnings
    -- MSVC: Disabled POSIX warnings
    -- MSVC: Disabled generic compiletime warnings
    -- Found OpenSSL library: optimized;C:/OpenSSL-Win32/lib/VC/ssleay32MD.lib;C:/OpenSSL-Win32/lib/VC/libeay32MD.lib;debug;C:/OpenSSL-Win32/lib/VC/ssleay32MDd.lib;C:/OpenSSL-Win32/lib/VC/libeay32MDd.lib
    -- Found OpenSSL headers: C:/OpenSSL-Win32/include
    -- Found ZMQ library: C:/Program Files/ZeroMQ 4.0.4/lib/libzmq-v120-mt-4_0_4.lib
    -- Found ZMQ headers: C:/Program Files/ZeroMQ 4.0.4/include
    CMake Warning (dev) at cmake/macros/FindBoost.cmake:344 (if):
    Policy CMP0054 is not set: Only interpret if() arguments as variables or
    keywords when unquoted. Run "cmake --help-policy CMP0054" for policy
    details. Use the cmake_policy command to set the policy and suppress this
    warning.

    Quoted variables like "MSVC" will no longer be dereferenced when the policy
    is set to NEW. Since the policy is not set the OLD behavior will be used.
    Call Stack (most recent call first):
    cmake/macros/FindBoost.cmake:741 (_Boost_GUESS_COMPILER_PREFIX)
    cmake/macros/ConfigureBoost.cmake:28 (find_package)
    CMakeLists.txt:61 (include)
    This warning is for project developers. Use -Wno-dev to suppress it.

    -- Boost version: 1.57.0
    -- Found the following Boost libraries:
    -- system
    -- thread
    -- program_options
    -- Found MySQL library: C:/Program Files/MySQL/MySQL Server 5.5/lib/libmysql.lib
    -- Found MySQL headers: C:/Program Files/MySQL/MySQL Server 5.5/include
    CMake Error at cmake/macros/FindGit.cmake:24 (message):


    Git was NOT FOUND on your system - did you forget to install a recent version, or setting the path to it?
    Observe that for revision hash/date to work you need at least version 1.7
    Call Stack (most recent call first):
    CMakeLists.txt:71 (find_package)


    -- Configuring incomplete, errors occurred!
    See also "E:/build/CMakeFiles/CMakeOutput.log".
    See also "E:/build/CMakeFiles/CMakeError.log".
    1>C:\Program Files\MSBuild\Microsoft.Cpp\v4.0\V120\Microsoft.Cp pCommon.targets(170,5): error MSB6006: "cmd.exe" exited with code 1.
    1>Done Building Project "E:\build\src\server\scripts\scripts.vcxproj" (Build target(s)) -- FAILED.


    Build FAILED.


    Time Elapsed 00:00:00.51


  8. #17
    دستاورد ها:
    اجتماعیRecommendation First Class1 سال ثبت نام شده استبرچسب زن کلاس اولاوردرایو

    شماره عضویت
    1
    تاریخ عضویت
    Oct 2014
    محل سکونت
    بوشهر
    نوشته ها
    1,774
    نسل
    نسل مورد علاقه
    نژاد
    نژاد  مورد علاقه
    کلاس
     کلاس  مورد علاقه
    سورس
     سورس مورد علاقه
    پچ
    پچ مورد علاقه
    پسندیده : 725
    مورد پسند : 1,163 بار در 582 پست
    سیستم عامل و مرورگر:
    عزیز جای این چیزا توی این پست نیست .

    این مربوط به گیت هست . که روی سیستم شما نصب نیست .

  9. #18
    دستاورد ها:
    1 سال ثبت نام شده استبرچسب زن کلاس اول۱۰۰۰ امتیازاوردرایو

    شماره عضویت
    170
    تاریخ عضویت
    Feb 2015
    محل سکونت
    Iran-Tabriz
    نوشته ها
    202
    نسل
    نسل مورد علاقه
    نژاد
    نژاد  مورد علاقه
    کلاس
     کلاس  مورد علاقه
    سورس
     سورس مورد علاقه
    پچ
    پچ مورد علاقه
    پسندیده : 124
    مورد پسند : 60 بار در 43 پست
    سیستم عامل و مرورگر:
    بله all_buildرو زدم بازم ارور داد بعدش رفتم دیدم هرچی قبلا کمپایل شده حذف شدن worldserver&autserver

  10. #19
    دستاورد ها:
    اجتماعیRecommendation First Class1 سال ثبت نام شده استبرچسب زن کلاس اولاوردرایو

    شماره عضویت
    1
    تاریخ عضویت
    Oct 2014
    محل سکونت
    بوشهر
    نوشته ها
    1,774
    نسل
    نسل مورد علاقه
    نژاد
    نژاد  مورد علاقه
    کلاس
     کلاس  مورد علاقه
    سورس
     سورس مورد علاقه
    پچ
    پچ مورد علاقه
    پسندیده : 725
    مورد پسند : 1,163 بار در 582 پست
    سیستم عامل و مرورگر:
    مشکلات اررور ها رو تنها كاربران عضو مي توانند لينك ها را مشاهده كنند. اینجا بزارید . این پست جای این چیزا نیست .

  11. #20

    شماره عضویت
    100
    تاریخ عضویت
    Jan 2015
    نوشته ها
    5
    پسندیده : 0
    مورد پسند : 14 بار در 4 پست
    سیستم عامل و مرورگر:
    بعد از ریختن اسکریپت یک بارم با Cmake Generate کنید

    کاربر مقابل پست vanasis عزیز را پسندیده است:

    Nightprince (02-19-2015)


صفحه 2 از 3 نخستنخست 123 آخرینآخرین

کلمات کلیدی این موضوع

مجوز های ارسال و ویرایش

  • شما نمیتوانید موضوع جدیدی ارسال کنید
  • شما امکان ارسال پاسخ را ندارید
  • شما نمیتوانید فایل پیوست کنید.
  • شما نمیتوانید پست های خود را ویرایش کنید
  •