سلام ، آیا این بازدید اول شماست ؟ یا
logo_forum_header
راه اندازی  Trinity Core روی ویندوز

تبلیغات
×
+
سفارش تبلیغات
راه اندازی  Trinity Core روی ویندوز راه اندازی  Trinity Core روی ویندوز
راه اندازی  Trinity Core روی ویندوز راه اندازی  Trinity Core روی ویندوز
صفحه 55 از 81 نخستنخست ... 545535455565765 ... آخرینآخرین
نمایش نتایج: از 541 به 550 از 806

موضوع: راه اندازی Trinity Core روی ویندوز

  1. #541

    شماره عضویت
    1
    تاریخ عضویت
    Oct 2014
    محل سکونت
    بوشهر
    نوشته ها
    2,169
    نسل
    نسل مورد علاقه
    نژاد
    نژاد  مورد علاقه
    کلاس
     کلاس  مورد علاقه
    سورس
     سورس مورد علاقه
    پچ
    پچ مورد علاقه
    پسندیده : 685
    مورد پسند : 4,813 بار در 2,174 پست
    سیستم عامل و مرورگر:
    Linux (Android 6.0) Chrome 59.0.3071.125
    نقل قول نوشته اصلی توسط kidmasol نمایش پست ها
    خب عزیز راه هلش رو دقیق می تونین بگین ؟
    راه حلش یا اطلاعات وارد شده دیتابیس اشتباه یا دیتابیس world خالیه یا تیبل کامند حذف شده

  2. 2 کاربر پست Nightprince عزیز را پسندیده اند .

    موبوگرام (12-10-2022), اکانت مجازی تیندر (11-26-2022)

  3. #542

    شماره عضویت
    1250
    تاریخ عضویت
    Jun 2016
    محل سکونت
    Karaj
    نوشته ها
    30
    نسل
    نسل مورد علاقه
    نژاد
    نژاد  مورد علاقه
    کلاس
     کلاس  مورد علاقه
    سورس
     سورس مورد علاقه
    پچ
    پچ مورد علاقه
    پسندیده : 1
    مورد پسند : 44 بار در 30 پست
    سیستم عامل و مرورگر:
    Windows 7 Chrome 60.0.3112.90
    سلام ی مشکل تو Cmake دارم وقتی Configure رو میزنم این ارور میاد

    CMake Error at CMakeLists.txt:15 (project):
    No CMAKE_CXX_COMPILER could be found.

    قبل از این اررور

    اررور Visual 2015 Update 3 داد که نصب کردم اما بازم پیدا نمیکنه ویندوز 64 بیته

    Visual رو از سایت دانلود کردم
    http://p30download.com/fa/entry/59678/
    اما بازم شناسایی نمیکنه میتونه از Cmake باشه ؟؟

    افزوده شده بعد از 1 32 دقیقه :
    ویرایش توسط Lov3ly : 08-13-2017 در ساعت 12:42 PM دلیل: ادغام پست

  4. کاربر مقابل پست Lov3ly عزیز را پسندیده است:


  5. #543

    شماره عضویت
    1250
    تاریخ عضویت
    Jun 2016
    محل سکونت
    Karaj
    نوشته ها
    30
    نسل
    نسل مورد علاقه
    نژاد
    نژاد  مورد علاقه
    کلاس
     کلاس  مورد علاقه
    سورس
     سورس مورد علاقه
    پچ
    پچ مورد علاقه
    پسندیده : 1
    مورد پسند : 44 بار در 30 پست
    سیستم عامل و مرورگر:
    Windows 7 Chrome 60.0.3112.90
    ارور جدید :|


    CMake Error at CMakeLists.txt:15 (project):
    Failed to run MSBuild command:

    C:/Program Files (x86)/MSBuild/14.0/bin/MSBuild.exe

    to get the value of VCTargetsPath:

    Microsoft (R) Build Engine version 14.0.25420.1


    Copyright (C) Microsoft Corporation. All rights reserved.




    Build started 8/13/2017 5:35:09 AM.


    Project "D:\Create Server\Source\CMakeFiles\3.9.1\VCTargetsPath.vcxpr oj" on node 1 (default targets).


    C:\Program Files (x86)\MSBuild\Microsoft.Cpp\v4.0\V140\Platforms\x6 4\PlatformToolsets\v140\Toolset.targets(36,5): error MSB8036: The Windows SDK version 8.1 was not found. Install the required version of Windows SDK or change the SDK version in the project property pages or by right-clicking the solution and selecting "Retarget solution". [D:\Create Server\Source\CMakeFiles\3.9.1\VCTargetsPath.vcxpr oj]


    Done Building Project "D:\Create Server\Source\CMakeFiles\3.9.1\VCTargetsPath.vcxpr oj" (default targets) -- FAILED.




    Build FAILED.




    "D:\Create Server\Source\CMakeFiles\3.9.1\VCTargetsPath.vcxpr oj" (default target) (1) ->


    (Desktop_PlatformPrepareForBuild target) ->


    C:\Program Files (x86)\MSBuild\Microsoft.Cpp\v4.0\V140\Platforms\x6 4\PlatformToolsets\v140\Toolset.targets(36,5): error MSB8036: The Windows SDK version 8.1 was not found. Install the required version of Windows SDK or change the SDK version in the project property pages or by right-clicking the solution and selecting "Retarget solution". [D:\Create Server\Source\CMakeFiles\3.9.1\VCTargetsPath.vcxpr oj]




    0 Warning(s)


    1 Error(s)




    Time Elapsed 00:00:01.39




    Exit code: 1



  6. کاربر مقابل پست Lov3ly عزیز را پسندیده است:


  7. #544

    شماره عضویت
    1
    تاریخ عضویت
    Oct 2014
    محل سکونت
    بوشهر
    نوشته ها
    2,169
    نسل
    نسل مورد علاقه
    نژاد
    نژاد  مورد علاقه
    کلاس
     کلاس  مورد علاقه
    سورس
     سورس مورد علاقه
    پچ
    پچ مورد علاقه
    پسندیده : 685
    مورد پسند : 4,813 بار در 2,174 پست
    سیستم عامل و مرورگر:
    Linux (Android 6.0) Chrome 59.0.3071.125
    نقل قول نوشته اصلی توسط Lov3ly نمایش پست ها
    ارور جدید :|


    CMake Error at CMakeLists.txt:15 (project):
    Failed to run MSBuild command:

    C:/Program Files (x86)/MSBuild/14.0/bin/MSBuild.exe

    to get the value of VCTargetsPath:

    Microsoft (R) Build Engine version 14.0.25420.1


    Copyright (C) Microsoft Corporation. All rights reserved.




    Build started 8/13/2017 5:35:09 AM.


    Project "D:\Create Server\Source\CMakeFiles\3.9.1\VCTargetsPath.vcxpr oj" on node 1 (default targets).


    C:\Program Files (x86)\MSBuild\Microsoft.Cpp\v4.0\V140\Platforms\x6 4\PlatformToolsets\v140\Toolset.targets(36,5): error MSB8036: The Windows SDK version 8.1 was not found. Install the required version of Windows SDK or change the SDK version in the project property pages or by right-clicking the solution and selecting "Retarget solution". [D:\Create Server\Source\CMakeFiles\3.9.1\VCTargetsPath.vcxpr oj]


    Done Building Project "D:\Create Server\Source\CMakeFiles\3.9.1\VCTargetsPath.vcxpr oj" (default targets) -- FAILED.




    Build FAILED.




    "D:\Create Server\Source\CMakeFiles\3.9.1\VCTargetsPath.vcxpr oj" (default target) (1) ->


    (Desktop_PlatformPrepareForBuild target) ->


    C:\Program Files (x86)\MSBuild\Microsoft.Cpp\v4.0\V140\Platforms\x6 4\PlatformToolsets\v140\Toolset.targets(36,5): error MSB8036: The Windows SDK version 8.1 was not found. Install the required version of Windows SDK or change the SDK version in the project property pages or by right-clicking the solution and selecting "Retarget solution". [D:\Create Server\Source\CMakeFiles\3.9.1\VCTargetsPath.vcxpr oj]




    0 Warning(s)


    1 Error(s)




    Time Elapsed 00:00:01.39




    Exit code: 1


    ویندوز ۱۰ نصب کن

  8. کاربر مقابل پست Nightprince عزیز را پسندیده است:


  9. #545

    شماره عضویت
    604
    تاریخ عضویت
    Aug 2015
    نوشته ها
    100
    نسل
    نسل مورد علاقه
    نژاد
    نژاد  مورد علاقه
    کلاس
     کلاس  مورد علاقه
    سورس
     سورس مورد علاقه
    پسندیده : 109
    مورد پسند : 189 بار در 100 پست
    سیستم عامل و مرورگر:
    Windows 7 Firefox 47.0
    با سلام
    شرمنده من با این ارور در cmake رو به رو شدم.
    سورس ترینیتی 3.3.5 هست
    CMake Error at cmake/compiler/msvc/settings.cmake:7 (message):
    MSVC: TrinityCore requires version 19.00.23506 (MSVC 2015 Update 1) to
    build but found 18.0.31101.0
    Call Stack (most recent call first):
    cmake/platform/win/settings.cmake:6 (include)
    cmake/macros/CheckPlatform.cmake:11 (include)
    CMakeLists.txt:58 (include)

  10. 2 کاربر پست Gerrard عزیز را پسندیده اند .

    موبوگرام (12-10-2022), اکانت مجازی تیندر (11-26-2022)

  11. #546

    شماره عضویت
    1
    تاریخ عضویت
    Oct 2014
    محل سکونت
    بوشهر
    نوشته ها
    2,169
    نسل
    نسل مورد علاقه
    نژاد
    نژاد  مورد علاقه
    کلاس
     کلاس  مورد علاقه
    سورس
     سورس مورد علاقه
    پچ
    پچ مورد علاقه
    پسندیده : 685
    مورد پسند : 4,813 بار در 2,174 پست
    سیستم عامل و مرورگر:
    Windows 10 Firefox 54.0
    نقل قول نوشته اصلی توسط Gerrard نمایش پست ها
    با سلام
    شرمنده من با این ارور در cmake رو به رو شدم.
    سورس ترینیتی 3.3.5 هست
    CMake Error at cmake/compiler/msvc/settings.cmake:7 (message):
    MSVC: TrinityCore requires version 19.00.23506 (MSVC 2015 Update 1) to
    build but found 18.0.31101.0
    Call Stack (most recent call first):
    cmake/platform/win/settings.cmake:6 (include)
    cmake/macros/CheckPlatform.cmake:11 (include)
    CMakeLists.txt:58 (include)
    ویژوال 2015 میخواد ولی مال شما 2013 است .

  12. 3 کاربر پست Nightprince عزیز را پسندیده اند .

    Gerrard (08-23-2017), موبوگرام (12-10-2022), اکانت مجازی تیندر (11-26-2022)

  13. #547

    شماره عضویت
    1940
    تاریخ عضویت
    Aug 2017
    نوشته ها
    2
    نسل
    نسل مورد علاقه
    نژاد
    نژاد  مورد علاقه
    کلاس
     کلاس  مورد علاقه
    سورس
     سورس مورد علاقه
    پسندیده : 6
    مورد پسند : 3 بار در 2 پست
    سیستم عامل و مرورگر:
    Windows 10 Chrome 58.0.3029.81
    آموزش خوبی بود .

    اندکی اسپم :

    توی عکس System Properties پردازنده شما 5700 هست ولی رم شما 32 گیگابایت .

    جریان چیه ناقلا ؟؟

  14. کاربر مقابل پست StratusKala عزیز را پسندیده است:


  15. #548

    شماره عضویت
    604
    تاریخ عضویت
    Aug 2015
    نوشته ها
    100
    نسل
    نسل مورد علاقه
    نژاد
    نژاد  مورد علاقه
    کلاس
     کلاس  مورد علاقه
    سورس
     سورس مورد علاقه
    پسندیده : 109
    مورد پسند : 189 بار در 100 پست
    سیستم عامل و مرورگر:
    Windows 7 Firefox 47.0
    نقل قول نوشته اصلی توسط Nightprince نمایش پست ها
    ویژوال 2015 میخواد ولی مال شما 2013 است .
    من 2015 رو از سایت زیر دان کردم
    [فقط کاربران عضو شده قادر به مشاهده لینک ها هستند. ]
    و با ارور زیر مواجه شدم
    The C compiler identification is unknown The CXX compiler identification is unknown
    CMake Error at CMakeLists.txt:15 (project):
    No CMAKE_C_COMPILER could be found.



    CMake Error at CMakeLists.txt:15 (project):
    No CMAKE_CXX_COMPILER could be found.


    خیلی ممنون و متشکر بابت وقت و زحمتتون

  16. 2 کاربر پست Gerrard عزیز را پسندیده اند .

    موبوگرام (12-10-2022), اکانت مجازی تیندر (11-26-2022)

  17. #549

    شماره عضویت
    848
    تاریخ عضویت
    Nov 2015
    محل سکونت
    IR.Teh
    نوشته ها
    80
    نسل
    نسل مورد علاقه
    نژاد
    نژاد  مورد علاقه
    کلاس
     کلاس  مورد علاقه
    سورس
     سورس مورد علاقه
    پچ
    پچ مورد علاقه
    پسندیده : 28
    مورد پسند : 137 بار در 80 پست
    سیستم عامل و مرورگر:
    Windows 7 Chrome 60.0.3112.101
    نقل قول نوشته اصلی توسط Gerrard نمایش پست ها
    من 2015 رو از سایت زیر دان کردم [فقط کاربران عضو شده قادر به مشاهده لینک ها هستند. ] و با ارور زیر مواجه شدم The C compiler identification is unknown The CXX compiler identification is unknown CMake Error at CMakeLists.txt:15 (project): No CMAKE_C_COMPILER could be found. CMake Error at CMakeLists.txt:15 (project): No CMAKE_CXX_COMPILER could be found. خیلی ممنون و متشکر بابت وقت و زحمتتون

    توی مراحل نصب Visual Studio گزینه Common Tools for Visual C++ 2015 باید فعال باشه حتما واگر نه ++C رو نصب نمیکنه
    اگه فعال نکردیش یک بار بصورت کامل پاک کن دوباره درست نصبش کن

  18. 3 کاربر پست Leviathan عزیز را پسندیده اند .

    Gerrard (08-27-2017), Nightprince (08-27-2017), اکانت مجازی تیندر (11-26-2022)

  19. #550

    شماره عضویت
    891
    تاریخ عضویت
    Dec 2015
    محل سکونت
    بوشهر
    نوشته ها
    213
    نسل
    نسل مورد علاقه
    نژاد
    نژاد  مورد علاقه
    کلاس
     کلاس  مورد علاقه
    سورس
     سورس مورد علاقه
    پچ
    پچ مورد علاقه
    پسندیده : 51
    مورد پسند : 416 بار در 213 پست
    سیستم عامل و مرورگر:
    Windows 10 Chrome 60.0.3112.113
    سلام ببخشید کسی OpenSSL ver 1.0.0 رو داره ؟ نمیتونم پیدا کنمش
    CMake Error at cmake/macros/FindOpenSSL.cmake:223 (message):
    TrinityCore needs OpenSSL version 1.0.0 but found version ..`
    Call Stack (most recent call first):

    CMakeLists.txt:57 (find_package)

  20. 2 کاربر پست 1213 عزیز را پسندیده اند .

    موبوگرام (12-10-2022), اکانت مجازی تیندر (11-26-2022)

صفحه 55 از 81 نخستنخست ... 545535455565765 ... آخرینآخرین

کلمات کلیدی این موضوع

3.3.5، ==========، build، cmake، control، core، failed، html، jpg، map، maps، master، net، openssl، panel، realmlist، release، root، server، set، simple، skipped، solution، succeeded، system، tdb، trinity، trinitycore، up-to-date، فولدر، فقط، فایل، فعالیت، کلیک، کنیم، کنید، کنند، کنار، که، کامپایل، کامل، کد، کدام، کردن، کرده، گرفتن، گزینه، پوشه، پاک، ویندوز، وقتی، ولی، وبسایت، ورود، ورژن، وسط، وصل، قرار، قسمت، نیز، چیزی، نیست، نمی، نام، نصب، همچنین، همه، همان، های، مکان، میکنید، میکند، میباشد، میتوانید، میشود، موفق، مورد، مناسب، مانند، مثال، مدیریت، مرحله، مشکل، معمولا، vmap، vmaps، warcraft، world، wotlk، wow، آپدیت، آن، آنها، آموزش، اینکه، اینجا، اول، الان، اندازی، امکان، اجرا، ادامه، اسم، اضافه، بودن، بقیه، به، بالا، باز، بازی، باشید، باشد، بدهیم، برنامه، برای، بزنید، بسته، تیبل، توانید، توضیح، تمایل، تمام، تمامی، تغییر، تغییراتی، تصویری، جهت، جای، جدید، حالت، حذف، خیلی، خواهد، دیتابیس، دلخواه، دهید، دانلود، دارید، دارد، داشته، در، ذخیره، ریلم، روی، روش، راه، زیر، زده، سپس، سیستم، سورس، سمت، سایت، ساخت، ساخته، سخت، سریع، سرور، شوید، شما، شدن، شروع، طریق، صورت

نمایش برچسب‌ها

مجوز های ارسال و ویرایش

  • شما نمیتوانید موضوع جدیدی ارسال کنید
  • شما امکان ارسال پاسخ را ندارید
  • شما نمیتوانید فایل پیوست کنید.
  • شما نمیتوانید پست های خود را ویرایش کنید
  •