سلام ، آیا این بازدید اول شماست ؟ یا
logo_forum_header

تبلیغات
×
+
سفارش تبلیغات

صفحه 70 از 80 نخستنخست ... 20606869707172 ... آخرینآخرین
نمایش نتایج: از 691 به 700 از 791
Like Tree66Likes

موضوع: راه اندازی Trinity Core روی ویندوز

  1. #691

    شماره عضویت
    2300
    تاریخ عضویت
    May 2018
    نوشته ها
    11
    نسل
    نسل مورد علاقه
    نژاد
    نژاد  مورد علاقه
    کلاس
     کلاس  مورد علاقه
    سورس
     سورس مورد علاقه
    پسندیده : 4
    مورد پسند : 0 بار در 0 پست
    سیستم عامل و مرورگر:
    سلام خسته نباشید
    ما به چه شکلی می توانیم با مدیر تماس بگیریم؟

  2. #692

    شماره عضویت
    114
    تاریخ عضویت
    Jan 2015
    محل سکونت
    Iran
    نوشته ها
    62
    نسل
    نسل مورد علاقه
    نژاد
    نژاد  مورد علاقه
    کلاس
     کلاس  مورد علاقه
    سورس
     سورس مورد علاقه
    پچ
    پچ مورد علاقه
    پسندیده : 0
    مورد پسند : 32 بار در 22 پست
    سیستم عامل و مرورگر:
    به صورت فرستادن پیام خصوصی.
    لحظه ای پاک و بزرگ، دل به دریا زد و رفت

  3. #693

    شماره عضویت
    2300
    تاریخ عضویت
    May 2018
    نوشته ها
    11
    نسل
    نسل مورد علاقه
    نژاد
    نژاد  مورد علاقه
    کلاس
     کلاس  مورد علاقه
    سورس
     سورس مورد علاقه
    پسندیده : 4
    مورد پسند : 0 بار در 0 پست
    سیستم عامل و مرورگر:
    انگار صندوق پیام های ایشون پره نمی شه به ایشون پیام داد

  4. #694

    شماره عضویت
    1
    تاریخ عضویت
    Oct 2014
    محل سکونت
    بوشهر
    نوشته ها
    2,236
    نسل
    نسل مورد علاقه
    نژاد
    نژاد  مورد علاقه
    کلاس
     کلاس  مورد علاقه
    سورس
     سورس مورد علاقه
    پچ
    پچ مورد علاقه
    پسندیده : 709
    مورد پسند : 1,258 بار در 633 پست
    سیستم عامل و مرورگر:
    نقل قول نوشته اصلی توسط ahwazhost نمایش پست ها
    انگار صندوق پیام های ایشون پره نمی شه به ایشون پیام داد
    تلگرام : nightprince8855@

  5. #695

    شماره عضویت
    682
    تاریخ عضویت
    Sep 2015
    نوشته ها
    21
    نسل
    نسل مورد علاقه
    نژاد
    نژاد  مورد علاقه
    کلاس
     کلاس  مورد علاقه
    سورس
     سورس مورد علاقه
    پسندیده : 2
    مورد پسند : 1 بار در 1 پست
    سیستم عامل و مرورگر:
    با سلام و عزض ادب خدمت همگی. اول از همه واقعا معذرت میخوام که اینجا دارم این مساله رو اعلام میکنم میدونم جاش نبود. nightprince عزیز کاری باهاتون داشتم از طریق Skype پیام دادم جواب ندادین پیام خصوصی هم نمیشه واستون فرستاد. اگه ممکنه تو Skype پیامم رو بخونین و جواب بدبن. با تشکر و معذرت خواهی مجدد

  6. #696

    شماره عضویت
    103
    تاریخ عضویت
    Jan 2015
    نوشته ها
    38
    نسل
    نسل مورد علاقه
    نژاد
    نژاد  مورد علاقه
    کلاس
     کلاس  مورد علاقه
    سورس
     سورس مورد علاقه
    پچ
    پچ مورد علاقه
    پسندیده : 6
    مورد پسند : 2 بار در 1 پست
    سیستم عامل و مرورگر:
    CMake Error: The source directory "F:/Src" does not appear to contain CMakeLists.txt.
    Specify --help for usage, or press the help button on the CMake GUI.


    این ارور برای چیه؟


    افزوده شده بعد از 33 دقیقه :
    CMake Error at CMakeLists.txt:12 (project):
    Cannot enable 64-bit tools with Visual Studio 2010 Express.

    Install the Microsoft Windows SDK v7.1 to get 64-bit tools:

    تنها كاربران عضو مي توانند لينك ها را مشاهده كنند.


    Configuring incomplete, errors occurred!
    See also "D:/new server wow/2/CMakeFiles/CMakeOutput.log".


    این ارور برا جیه؟ ممنون اگه کمک کنید
    ویرایش توسط master : 07-27-2018 در ساعت 02:53 PM دلیل: ادغام پست

  7. #697

    شماره عضویت
    1094
    تاریخ عضویت
    Feb 2016
    محل سکونت
    Azshara
    نوشته ها
    279
    نسل
    نسل مورد علاقه
    نژاد
    نژاد  مورد علاقه
    کلاس
     کلاس  مورد علاقه
    سورس
     سورس مورد علاقه
    پچ
    پچ مورد علاقه
    پسندیده : 62
    مورد پسند : 207 بار در 124 پست
    سیستم عامل و مرورگر:
    نقل قول نوشته اصلی توسط master نمایش پست ها
    CMake Error: The source directory "F:/Src" does not appear to contain CMakeLists.txt.
    Specify --help for usage, or press the help button on the CMake GUI.


    این ارور برای چیه؟




    CMake Error at CMakeLists.txt:12 (project):
    Cannot enable 64-bit tools with Visual Studio 2010 Express.

    Install the Microsoft Windows SDK v7.1 to get 64-bit tools:

    تنها كاربران عضو مي توانند لينك ها را مشاهده كنند.


    Configuring incomplete, errors occurred!
    See also "D:/new server wow/2/CMakeFiles/CMakeOutput.log".


    این ارور برا جیه؟ ممنون اگه کمک کنید
    سوال اول مشخصه دیگه میگه که توی اون فولدر فایل CMakeList.txt رو پیدا نمیکنه یا فولدر اشتباه انتخاب کردید یا اون فایل موجود نیست
    سوال دوم ویژوال Express اکر استفاده میکنید از Ultimate استفاده کنید یا از نسخه های جدیدتر ویژوال استودیو استفاده کنید
    امام علی(علیه السلام) :
    از دوستی با احمق برحذر باش، که می خواهد تو را سود دهد ولی زیان می رساند؛
    از رفاقت با بخیل بپرهیز، چه اینکه آنجا که به شدت به او نیازمندی از تو دریغ خواهد کرد؛
    و از دوستی با بدکار کناره بگیر، زیرا تو را به اندک چیزی می فروشد؛
    و از رفاقت با دروغگو حذر کن، چرا که مانند سراب است، دور را در نظرت نزدیک و نزدیک را دور می کند.
    نهج البلاغه



  8. #698

    شماره عضویت
    103
    تاریخ عضویت
    Jan 2015
    نوشته ها
    38
    نسل
    نسل مورد علاقه
    نژاد
    نژاد  مورد علاقه
    کلاس
     کلاس  مورد علاقه
    سورس
     سورس مورد علاقه
    پچ
    پچ مورد علاقه
    پسندیده : 6
    مورد پسند : 2 بار در 1 پست
    سیستم عامل و مرورگر:
    این کارو کردم این ارور را داد نسخه ultimate 2010 ریختم


    The C compiler identification is MSVC 16.0.30319.1
    The CXX compiler identification is MSVC 16.0.30319.1
    Check for working C compiler: C:/Program Files (x86)/Microsoft Visual Studio 10.0/VC/bin/x86_amd64/cl.exe
    Check for working C compiler: C:/Program Files (x86)/Microsoft Visual Studio 10.0/VC/bin/x86_amd64/cl.exe -- broken
    CMake Error at C:/Users/MASOUD/Downloads/Compressed/cmake-3.12.0-win64-x64/cmake-3.12.0-win64-x64/share/cmake-3.12/Modules/CMakeTestCCompiler.cmake:52 (message):
    The C compiler

    "C:/Program Files (x86)/Microsoft Visual Studio 10.0/VC/bin/x86_amd64/cl.exe"

    is not able to compile a simple test program.

    It fails with the following output:

    Change Dir: D:/new server wow/11/CMakeFiles/CMakeTmp

    Run Build Command:"C:/Windows/Microsoft.NET/Framework/v4.0.30319/MSBuild.exe" "cmTC_f0366.vcxproj" "/p:Configuration=Debug" "/p:VisualStudioVersion=10.0"
    Microsoft (R) Build Engine version 4.7.2558.0


    [Microsoft .NET Framework, version 4.0.30319.42000]


    Copyright (C) Microsoft Corporation. All rights reserved.




    Build started 2018/07/27 04:54:59 ç.â.


    Project "D:\new server wow\11\CMakeFiles\CMakeTmp\cmTC_f0366.vcxproj" on node 1 (default targets).


    PrepareForBuild:


    Creating directory "cmTC_f0366.dir\Debug".


    Creating directory "D:\new server wow\11\CMakeFiles\CMakeTmp\Debug".


    InitializeBuildStatus:


    Creating "cmTC_f0366.dir\Debug\cmTC_f0366.unsuccessfulbuild " because "AlwaysCreate" was specified.


    ClCompile:


    C:\Program Files (x86)\Microsoft Visual Studio 10.0\VC\bin\x86_amd64\CL.exe /c /Zi /W3 /WX- /Od /Ob0 /D WIN32 /D _WINDOWS /D "CMAKE_INTDIR="Debug"" /D _MBCS /Gm- /RTC1 /MDd /GS /fp:precise /Zc:wchar_t /Zc:forScope /Fo"cmTC_f0366.dir\Debug\" /Fd"cmTC_f0366.dir\Debug\vc100.pdb" /Gd /TC /errorReport:queue testCCompiler.c


    Microsoft (R) C/C++ Optimizing Compiler Version 16.00.30319.01 for x64


    Copyright (C) Microsoft Corporation. All rights reserved.




    cl /c /Zi /W3 /WX- /Od /Ob0 /D WIN32 /D _WINDOWS /D "CMAKE_INTDIR="Debug"" /D _MBCS /Gm- /RTC1 /MDd /GS /fp:precise /Zc:wchar_t /Zc:forScope /Fo"cmTC_f0366.dir\Debug\" /Fd"cmTC_f0366.dir\Debug\vc100.pdb" /Gd /TC /errorReport:queue testCCompiler.c




    testCCompiler.c


    ManifestResourceCompile:


    C:\Program Files (x86)\Microsoft SDKs\Windows\v7.0A\bin\rc.exe /nologo /fo"cmTC_f0366.dir\Debug\cmTC_f0366.exe.embed.manif est.res" cmTC_f0366.dir\Debug\cmTC_f0366_manifest.rc


    Link:


    C:\Program Files (x86)\Microsoft Visual Studio 10.0\VC\bin\x86_amd64\link.exe /ERRORREPORT:QUEUE /OUT:"D:\new server wow\11\CMakeFiles\CMakeTmp\Debug\cmTC_f0366.exe" /INCREMENTAL /NOLOGO kernel32.lib user32.lib gdi32.lib winspool.lib shell32.lib ole32.lib oleaut32.lib uuid.lib comdlg32.lib advapi32.lib /MANIFEST /ManifestFile:"cmTC_f0366.dir\Debug\cmTC_f0366.exe. intermediate.manifest" /MANIFESTUAC:"level='asInvoker' uiAccess='false'" /DEBUG /PDB:"D:/new server wow/11/CMakeFiles/CMakeTmp/Debug/cmTC_f0366.pdb" /SUBSYSTEM:CONSOLE /TLBID:1 /DYNAMICBASE /NXCOMPAT /IMPLIB:"D:/new server wow/11/CMakeFiles/CMakeTmp/Debug/cmTC_f0366.lib" /MACHINE:X64 cmTC_f0366.dir\Debug\cmTC_f0366.exe.embed.manifest .res


    cmTC_f0366.dir\Debug\testCCompiler.obj /machine:x64


    LINK : fatal error LNK1123: failure during conversion to COFF: file invalid or corrupt [D:\new server wow\11\CMakeFiles\CMakeTmp\cmTC_f0366.vcxproj]


    Done Building Project "D:\new server wow\11\CMakeFiles\CMakeTmp\cmTC_f0366.vcxproj" (default targets) -- FAILED.




    Build FAILED.




    "D:\new server wow\11\CMakeFiles\CMakeTmp\cmTC_f0366.vcxproj" (default target) (1) ->


    (Link target) ->


    LINK : fatal error LNK1123: failure during conversion to COFF: file invalid or corrupt [D:\new server wow\11\CMakeFiles\CMakeTmp\cmTC_f0366.vcxproj]




    0 Warning(s)


    1 Error(s)




    Time Elapsed 00:00:03.58






    CMake will not be able to correctly generate this project.
    Call Stack (most recent call first):
    CMakeLists.txt:12 (project)


    Configuring incomplete, errors occurred!
    See also "D:/new server wow/11/CMakeFiles/CMakeOutput.log".
    See also "D:/new server wow/11/CMakeFiles/CMakeError.log".

  9. #699

    شماره عضویت
    1
    تاریخ عضویت
    Oct 2014
    محل سکونت
    بوشهر
    نوشته ها
    2,236
    نسل
    نسل مورد علاقه
    نژاد
    نژاد  مورد علاقه
    کلاس
     کلاس  مورد علاقه
    سورس
     سورس مورد علاقه
    پچ
    پچ مورد علاقه
    پسندیده : 709
    مورد پسند : 1,258 بار در 633 پست
    سیستم عامل و مرورگر:
    نقل قول نوشته اصلی توسط master نمایش پست ها
    این کارو کردم این ارور را داد نسخه ultimate 2010 ریختم


    The C compiler identification is MSVC 16.0.30319.1
    The CXX compiler identification is MSVC 16.0.30319.1
    Check for working C compiler: C:/Program Files (x86)/Microsoft Visual Studio 10.0/VC/bin/x86_amd64/cl.exe
    Check for working C compiler: C:/Program Files (x86)/Microsoft Visual Studio 10.0/VC/bin/x86_amd64/cl.exe -- broken
    CMake Error at C:/Users/MASOUD/Downloads/Compressed/cmake-3.12.0-win64-x64/cmake-3.12.0-win64-x64/share/cmake-3.12/Modules/CMakeTestCCompiler.cmake:52 (message):
    The C compiler

    "C:/Program Files (x86)/Microsoft Visual Studio 10.0/VC/bin/x86_amd64/cl.exe"

    is not able to compile a simple test program.

    It fails with the following output:

    Change Dir: D:/new server wow/11/CMakeFiles/CMakeTmp

    Run Build Command:"C:/Windows/Microsoft.NET/Framework/v4.0.30319/MSBuild.exe" "cmTC_f0366.vcxproj" "/p:Configuration=Debug" "/p:VisualStudioVersion=10.0"
    Microsoft (R) Build Engine version 4.7.2558.0


    [Microsoft .NET Framework, version 4.0.30319.42000]


    Copyright (C) Microsoft Corporation. All rights reserved.




    Build started 2018/07/27 04:54:59 ç.â.


    Project "D:\new server wow\11\CMakeFiles\CMakeTmp\cmTC_f0366.vcxproj" on node 1 (default targets).


    PrepareForBuild:


    Creating directory "cmTC_f0366.dir\Debug".


    Creating directory "D:\new server wow\11\CMakeFiles\CMakeTmp\Debug".


    InitializeBuildStatus:


    Creating "cmTC_f0366.dir\Debug\cmTC_f0366.unsuccessfulbuild " because "AlwaysCreate" was specified.


    ClCompile:


    C:\Program Files (x86)\Microsoft Visual Studio 10.0\VC\bin\x86_amd64\CL.exe /c /Zi /W3 /WX- /Od /Ob0 /D WIN32 /D _WINDOWS /D "CMAKE_INTDIR="Debug"" /D _MBCS /Gm- /RTC1 /MDd /GS /fp:precise /Zc:wchar_t /Zc:forScope /Fo"cmTC_f0366.dir\Debug" /Fd"cmTC_f0366.dir\Debug\vc100.pdb" /Gd /TC /errorReport:queue testCCompiler.c


    Microsoft (R) C/C++ Optimizing Compiler Version 16.00.30319.01 for x64


    Copyright (C) Microsoft Corporation. All rights reserved.




    cl /c /Zi /W3 /WX- /Od /Ob0 /D WIN32 /D _WINDOWS /D "CMAKE_INTDIR="Debug"" /D _MBCS /Gm- /RTC1 /MDd /GS /fp:precise /Zc:wchar_t /Zc:forScope /Fo"cmTC_f0366.dir\Debug" /Fd"cmTC_f0366.dir\Debug\vc100.pdb" /Gd /TC /errorReport:queue testCCompiler.c




    testCCompiler.c


    ManifestResourceCompile:


    C:\Program Files (x86)\Microsoft SDKs\Windows\v7.0A\bin\rc.exe /nologo /fo"cmTC_f0366.dir\Debug\cmTC_f0366.exe.embed.manif est.res" cmTC_f0366.dir\Debug\cmTC_f0366_manifest.rc


    Link:


    C:\Program Files (x86)\Microsoft Visual Studio 10.0\VC\bin\x86_amd64\link.exe /ERRORREPORT:QUEUE /OUT:"D:\new server wow\11\CMakeFiles\CMakeTmp\Debug\cmTC_f0366.exe" /INCREMENTAL /NOLOGO kernel32.lib user32.lib gdi32.lib winspool.lib shell32.lib ole32.lib oleaut32.lib uuid.lib comdlg32.lib advapi32.lib /MANIFEST /ManifestFile:"cmTC_f0366.dir\Debug\cmTC_f0366.exe. intermediate.manifest" /MANIFESTUAC:"level='asInvoker' uiAccess='false'" /DEBUG /PDB:"D:/new server wow/11/CMakeFiles/CMakeTmp/Debug/cmTC_f0366.pdb" /SUBSYSTEM:CONSOLE /TLBID:1 /DYNAMICBASE /NXCOMPAT /IMPLIB:"D:/new server wow/11/CMakeFiles/CMakeTmp/Debug/cmTC_f0366.lib" /MACHINE:X64 cmTC_f0366.dir\Debug\cmTC_f0366.exe.embed.manifest .res


    cmTC_f0366.dir\Debug\testCCompiler.obj /machine:x64


    LINK : fatal error LNK1123: failure during conversion to COFF: file invalid or corrupt [D:\new server wow\11\CMakeFiles\CMakeTmp\cmTC_f0366.vcxproj]


    Done Building Project "D:\new server wow\11\CMakeFiles\CMakeTmp\cmTC_f0366.vcxproj" (default targets) -- FAILED.




    Build FAILED.




    "D:\new server wow\11\CMakeFiles\CMakeTmp\cmTC_f0366.vcxproj" (default target) (1) ->


    (Link target) ->


    LINK : fatal error LNK1123: failure during conversion to COFF: file invalid or corrupt [D:\new server wow\11\CMakeFiles\CMakeTmp\cmTC_f0366.vcxproj]




    0 Warning(s)


    1 Error(s)




    Time Elapsed 00:00:03.58






    CMake will not be able to correctly generate this project.
    Call Stack (most recent call first):
    CMakeLists.txt:12 (project)


    Configuring incomplete, errors occurred!
    See also "D:/new server wow/11/CMakeFiles/CMakeOutput.log".
    See also "D:/new server wow/11/CMakeFiles/CMakeError.log".
    سورست چی هست اصلا ؟
    master likes this.

  10. #700

    شماره عضویت
    103
    تاریخ عضویت
    Jan 2015
    نوشته ها
    38
    نسل
    نسل مورد علاقه
    نژاد
    نژاد  مورد علاقه
    کلاس
     کلاس  مورد علاقه
    سورس
     سورس مورد علاقه
    پچ
    پچ مورد علاقه
    پسندیده : 6
    مورد پسند : 2 بار در 1 پست
    سیستم عامل و مرورگر:
    سورسم 3.3.5
    ترینیتی
    ویرایش توسط master : 07-27-2018 در ساعت 05:24 PM

صفحه 70 از 80 نخستنخست ... 20606869707172 ... آخرینآخرین

کلمات کلیدی این موضوع

مجوز های ارسال و ویرایش

  • شما نمیتوانید موضوع جدیدی ارسال کنید
  • شما امکان ارسال پاسخ را ندارید
  • شما نمیتوانید فایل پیوست کنید.
  • شما نمیتوانید پست های خود را ویرایش کنید
  •